{"text_format":"1","workbook":"xlsx","n_sheets":7,"sheets":["Соответствие модификациям      ","    ↑↑↑↑   ОЛ ГАНК-4С    ↑↑↑↑  ","    ↑↑↑↑   ОЛ ГАНК-4М    ↑↑↑↑  ","    ↑↑↑↑  ОЛ ГАНК-4CEx   ↑↑↑↑  ","    ↑↑↑↑  ОЛ ГАНК-ФCEx   ↑↑↑↑  ","ИНСТРУКЦИЯ","Данные2"],"not_rendered":{"charts":0,"images":21,"macros":1,"external_links":1,"defined_names":7,"comments":0,"pivot_tables":0},"unopened":[],"bounds":{"document_bytes":16777216,"sheet_cells":100000,"rows_first":2000,"rows_last":500,"rows_between":2000,"halvings":0,"cell_chars":16384,"cell_head_chars":4096},"cells_cut":0,"cells_raw":0,"read":"whole","date_system":"1900"}

{"sheet":"Соответствие модификациям      ","index":0,"n_rows":14,"n_cols":5,"rows_kept":14,"cut":false,"hidden":false,"merged":[[0,1,0,2],[0,3,0,4],[0,0,1,0]]}
["Наименование вещества","ИСПОЛНЕНИЕ СТАЦИОНАРНОЕ ОБЩЕПРОМЫШЛЕННОЕ",null,"ИСПОЛНЕНИЕ СТАЦИОНАРНОЕ ВЗРЫВОЗВЩИЩЕННОЕ "]
[null,"ГАНК-4С (измерение на ХК) \n1 вещество в приборе","ГАНК-4М (измерение на Д) \nдо 3-х веществ в приборе","ГАНК-4СEx (2Exe[ib]dIIBT4Gc X) 1 вещество (Д или ХК)","ГАНК-4ФEx (с маркировкой взрывозащиты 1ExdIICT5Gb X)\nдо 4-х веществ в приборе"]
[null,{"$f":"IFERROR(VLOOKUP(A3,Данные2!A:AM,32,FALSE),\" \")","v":" "},{"$f":"IFERROR(VLOOKUP(A3,Данные2!A:AM,33,FALSE),\" \")","v":" "},{"$f":"IFERROR(VLOOKUP(A3,Данные2!A:AM,36,FALSE),\" \")","v":" "},{"$f":"IFERROR(VLOOKUP(A3,Данные2!A:AM,39,FALSE),\" \")","v":" "}]
[null,{"$f":"IFERROR(VLOOKUP(A4,Данные2!A:AM,32,FALSE),\" \")","v":" "},{"$f":"IFERROR(VLOOKUP(A4,Данные2!A:AM,33,FALSE),\" \")","v":" "},{"$f":"IFERROR(VLOOKUP(A4,Данные2!A:AM,36,FALSE),\" \")","v":" "},{"$f":"IFERROR(VLOOKUP(A4,Данные2!A:AM,39,FALSE),\" \")","v":" "}]
[null,{"$f":"IFERROR(VLOOKUP(A5,Данные2!A:AM,32,FALSE),\" \")","v":" "},{"$f":"IFERROR(VLOOKUP(A5,Данные2!A:AM,33,FALSE),\" \")","v":" "},{"$f":"IFERROR(VLOOKUP(A5,Данные2!A:AM,36,FALSE),\" \")","v":" "},{"$f":"IFERROR(VLOOKUP(A5,Данные2!A:AM,39,FALSE),\" \")","v":" "}]
[null,{"$f":"IFERROR(VLOOKUP(A6,Данные2!A:AM,32,FALSE),\" \")","v":" "},{"$f":"IFERROR(VLOOKUP(A6,Данные2!A:AM,33,FALSE),\" \")","v":" "},{"$f":"IFERROR(VLOOKUP(A6,Данные2!A:AM,36,FALSE),\" \")","v":" "},{"$f":"IFERROR(VLOOKUP(A6,Данные2!A:AM,39,FALSE),\" \")","v":" "}]
[null,{"$f":"IFERROR(VLOOKUP(A7,Данные2!A:AM,32,FALSE),\" \")","v":" "},{"$f":"IFERROR(VLOOKUP(A7,Данные2!A:AM,33,FALSE),\" \")","v":" "},{"$f":"IFERROR(VLOOKUP(A7,Данные2!A:AM,36,FALSE),\" \")","v":" "},{"$f":"IFERROR(VLOOKUP(A7,Данные2!A:AM,39,FALSE),\" \")","v":" "}]
[null,{"$f":"IFERROR(VLOOKUP(A8,Данные2!A:AM,32,FALSE),\" \")","v":" "},{"$f":"IFERROR(VLOOKUP(A8,Данные2!A:AM,33,FALSE),\" \")","v":" "},{"$f":"IFERROR(VLOOKUP(A8,Данные2!A:AM,36,FALSE),\" \")","v":" "},{"$f":"IFERROR(VLOOKUP(A8,Данные2!A:AM,39,FALSE),\" \")","v":" "}]
[null,{"$f":"IFERROR(VLOOKUP(A9,Данные2!A:AM,32,FALSE),\" \")","v":" "},{"$f":"IFERROR(VLOOKUP(A9,Данные2!A:AM,33,FALSE),\" \")","v":" "},{"$f":"IFERROR(VLOOKUP(A9,Данные2!A:AM,36,FALSE),\" \")","v":" "},{"$f":"IFERROR(VLOOKUP(A9,Данные2!A:AM,39,FALSE),\" \")","v":" "}]
[null,{"$f":"IFERROR(VLOOKUP(A10,Данные2!A:AM,32,FALSE),\" \")","v":" "},{"$f":"IFERROR(VLOOKUP(A10,Данные2!A:AM,33,FALSE),\" \")","v":" "},{"$f":"IFERROR(VLOOKUP(A10,Данные2!A:AM,36,FALSE),\" \")","v":" "},{"$f":"IFERROR(VLOOKUP(A10,Данные2!A:AM,39,FALSE),\" \")","v":" "}]
{"$rows_left_out":5}
{"sheet":"    ↑↑↑↑   ОЛ ГАНК-4С    ↑↑↑↑  ","index":1,"n_rows":36,"n_cols":47,"rows_kept":36,"cut":false,"hidden":false,"merged":[[7,3,7,4],[8,3,8,4],[10,3,10,4],[11,3,11,4]]}
["1. ВЫБРАТЬ: Наименование вещества↓↓↓","Наименование модификации","Стандартный порог срабатывания","СР-4",null,"2 КОЛ-ВО ГАНК-4 ЗАПОЛНИТЬ↓↓↓",null,null,null,null,null,null,null,null,null,null,null,null,null,null,null,null,null,null,null,null,null,null,null,null,null,null,null,null,{"$f":"IF(D2=\"Да\",\"Да\",\"\")","v":"Да"},"Да"]
["Р : Кислота серная (Р) 0,5 - 20 мг/м3",{"$f":"IFERROR(VLOOKUP(A2,Данные2!A:AM,32,FALSE),\" \")","v":"ГАНК-4С для определения: Кислота серная (Р)"},{"$f":"IFERROR(CONCATENATE(VLOOKUP(A2,Данные2!A:AM,26,FALSE),\" мг/м3\"),\" \")","v":"1 мг/м3"},{"$f":"IFERROR(VLOOKUP(A2,Данные2!A:AN,40,FALSE),\" \")","v":"Да"},null,null,null,null,null,null,null,null,null,null,null,null,null,null,null,null,null,null,null,null,null,null,null,null,null,null,null,null,null,null,{"$f":"IF(D2=\"Да\",\"Нет\",\"\")","v":"Нет"},"Нет"]
["Р : Азота оксид (оксид азота (II)) (Р) 2,5 - 100 мг/м3",null,null,null,null,null,null,null,null,null,null,null,null,null,null,null,null,null,null,null,null,null,null,null,null,null,null,null,null,null,null,null,null,null,"ВАРИАНТЫ ВЫПАДАЮЩЕГО СПИСКА ",null,null,null,null,null,null,"СЦЕПКА","ВОЗМОЖНЫЕ ВАР-ТЫ ДИНАМ. СПИСКОВ"]
["Р : Азота оксид (оксид азота (II)) (Р) 2,5 - 100 мг/м4",null,"3 ЗАПОЛНИТЬ↓↓↓"]
["Р : Азота оксид (оксид азота (II)) (Р) 2,5 - 100 мг/м5","Температура эксплуатации газоанализатора","от - 50 до + 50 ° С",null,null,null,null,null,null,null,null,null,null,null,null,null,null,null,null,null,null,null,null,null,null,null,null,null,null,null,null,null,null,null,"от +5 до +50° С","от - 50 до + 50 ° С",null,null,null,null,null,{"$f":"_xlfn.CONCAT(C5,\" и \",C6)","v":"от - 50 до + 50 ° С и Открытая площадка "},"от - 50 до + 50 ° С и Открытая площадка ","от +5 до +50° С и Открытая площадка ","от - 50 до + 50 ° С и В помещении","от +5 до +50° С и В помещении"]
["Р : Азота оксид (оксид азота (II)) (Р) 2,5 - 100 мг/м6","Место установки оборудования","Открытая площадка ",{"$f":"IF(C7=AJ7,\"ПОРОГ 1 не менее 1 ПДК р.з.\",\"\")","v":""},{"$f":"IF(C7=AJ7,\"ПОРОГ 2 не менее 3 ПДК р.з.\",\"\")","v":""},null,null,null,null,null,null,null,null,null,null,null,null,null,null,null,null,null,null,null,null,null,null,null,null,null,null,null,null,null,"Открытая площадка ","В помещении"]
["Р : Азота оксид (оксид азота (II)) (Р) 2,5 - 100 мг/м7","Пороги срабатывания сигн, реле","1 ПДК р.з. (По умолчанию)",null,null,null,null,null,null,null,null,null,null,null,null,null,null,null,null,null,null,null,null,null,null,null,null,null,null,null,null,null,null,null,"1 ПДК р.з. (По умолчанию)","Под заказ (уточнить какие)"]
["Р : Азота оксид (оксид азота (II)) (Р) 2,5 - 100 мг/м9","Питание прибора ",null,{"$f":"IF(C9=AJ9,\"Уточнить кабельный ввод\",\"\")","v":""},null,null,null,null,null,null,null,null,null,null,null,null,null,null,null,null,null,null,null,null,null,null,null,null,null,null,null,null,null,null,"220В (По умолчанию)","24В"]
["Р : Азота оксид (оксид азота (II)) (Р) 2,5 - 100 мг/м8","Подключение",null,null,null,null,null,null,null,null,null,null,null,null,null,null,null,null,null,null,null,null,null,null,null,null,null,null,null,null,null,null,null,null,"Ответные части разъемов типа MS-XS8/12 (По умолчанию)","Распределительная коробка с каб.вводами"]
[]
{"$rows_left_out":27}
{"sheet":"    ↑↑↑↑   ОЛ ГАНК-4М    ↑↑↑↑  ","index":2,"n_rows":40,"n_cols":47,"rows_kept":40,"cut":false,"hidden":false,"merged":[[10,3,10,4],[11,3,11,4]]}
["1. ВЫБРАТЬ вещества в приборе: Наименование вещества↓↓↓","Тип датчика: до двух (Д)","Стандартный порог срабатывания","Кол-во датчиков в приборе",null,"2 КОЛ-ВО ГАНК-4 ЗАПОЛНИТЬ↓↓↓",null,null,null,null,null,null,null,null,null,null,null,null,null,null,null,null,null,null,null,null,null,null,null,null,null,null,null,null,"Да"]
["Р : Аммиак (Р) 10 - 400 мг/м3",{"$f":"IFERROR(VLOOKUP(A2,Данные2!A:AM,37,FALSE),\" \")","v":"Д"},{"$f":"IFERROR(CONCATENATE(VLOOKUP(A2,Данные2!A:AM,26,FALSE),\" мг/м3\"),\" \")","v":"20 мг/м3"},{"$f":"COUNTIF(B2:B3,\"Д\")","v":1},null,null,null,null,null,null,null,null,null,null,null,null,null,null,null,null,null,null,null,null,null,null,null,null,null,null,null,null,null,null,"Нет"]
[null,{"$f":"IFERROR(VLOOKUP(A3,Данные2!A:AM,37,FALSE),\" \")","v":" "},{"$f":"IFERROR(CONCATENATE(VLOOKUP(A3,Данные2!A:AM,26,FALSE),\" мг/м3\"),\" \")","v":" "}]
["Р : Азота оксид (оксид азота (II)) (Р) 2,5 - 100 мг/м3",null,null,null,null,null,null,null,null,null,null,null,null,null,null,null,null,null,null,null,null,null,null,null,null,null,null,null,null,null,null,null,null,null,"ВАРИАНТЫ ВЫПАДАЮЩЕГО СПИСКА ",null,null,null,null,null,null,"СЦЕПКА","ВОЗМОЖНЫЕ ВАР-ТЫ ДИНАМ. СПИСКОВ"]
["Р : Азота оксид (оксид азота (II)) (Р) 2,5 - 100 мг/м4",null,"3 ЗАПОЛНИТЬ↓↓↓"]
["Р : Азота оксид (оксид азота (II)) (Р) 2,5 - 100 мг/м5","Температура эксплуатации газоанализатора",null,null,null,null,null,null,null,null,null,null,null,null,null,null,null,null,null,null,null,null,null,null,null,null,null,null,null,null,null,null,null,null,"от +5 до +50° С","от - 50 до + 50 ° С",null,null,null,null,null,{"$f":"_xlfn.CONCAT(C6,\" и \",C7)","v":" и "},"от - 50 до + 50 ° С и Открытая площадка ","от +5 до +50° С и Открытая площадка ","от - 50 до + 50 ° С и В помещении","от +5 до +50° С и В помещении"]
["Р : Азота оксид (оксид азота (II)) (Р) 2,5 - 100 мг/м6","Место установки оборудования",null,{"$f":"IF(C8=AJ8,\"ПОРОГ 1 не менее 1 ПДК р.з.\",\"\")","v":""},{"$f":"IF(C8=AJ8,\"ПОРОГ 2 не менее 3 ПДК р.з.\",\"\")","v":""},null,null,null,null,null,null,null,null,null,null,null,null,null,null,null,null,null,null,null,null,null,null,null,null,null,null,null,null,null,"Открытая площадка ","В помещении"]
["Р : Азота оксид (оксид азота (II)) (Р) 2,5 - 100 мг/м7","Пороги срабатывания сигн, реле",null,null,null,null,null,null,null,null,null,null,null,null,null,null,null,null,null,null,null,null,null,null,null,null,null,null,null,null,null,null,null,null,{"$f":"IF(D2=1,\"1 реле - 1 ПДК р.з., 2 реле - 2 ПДК р.з. (По умолчанию)\",IF(D2=2,\"реле 1 (ПОРОГ 1 - 1ПДК по любому из в-в)\nреле 2 (ПОРОГ 2 - 2 ПДК по любому из в-в) \",\"\"))","v":"1 реле - 1 ПДК р.з., 2 реле - 2 ПДК р.з. (По умолчанию)"},"Под заказ (уточнить значения)"]
[null,{"$f":"IF(D2=2,\"Выбор вещества для 4-20 мА (только 1 вых 4-20 мА)\",\"\")","v":""}]
[]
{"$rows_left_out":31}
{"sheet":"    ↑↑↑↑  ОЛ ГАНК-4CEx   ↑↑↑↑  ","index":3,"n_rows":41,"n_cols":46,"rows_kept":41,"cut":false,"hidden":false,"merged":[[7,3,7,4],[8,3,8,4],[12,3,12,4],[13,3,13,4],[5,3,5,4],[6,3,6,4],[9,3,9,4],[10,3,10,4]]}
["1. ВЫБРАТЬ: Наименование вещества↓↓↓","Наименование модификации","Стандартный порог срабатывания","Тип датчика","СР-4 Ex","2 КОЛ-ВО ГАНК-4 ЗАПОЛНИТЬ↓↓↓",null,null,null,null,null,null,null,null,null,null,null,null,null,null,null,null,null,null,null,null,null,null,null,null,null,null,null,null,{"$f":"IF(E2=\"Да\",\"Да\",\"\")","v":"Да"},"Да"]
["Р : Кислота серная (Р) 0,5 - 20 мг/м3",{"$f":"IFERROR(VLOOKUP(A2,Данные2!A:AM,36,FALSE),\" \")","v":"ГАНК-4СEx (Х) для определения: Кислота серная (Р)"},{"$f":"IFERROR(CONCATENATE(VLOOKUP(A2,Данные2!A:AM,26,FALSE),\" мг/м3\"),\" \")","v":"1 мг/м3"},{"$f":"IFERROR(VLOOKUP(A2,Данные2!A:AM,37,FALSE),\" \")","v":"Х"},{"$f":"IFERROR(VLOOKUP(A2,Данные2!A:AN,40,FALSE),\" \")","v":"Да"},null,null,null,null,null,null,null,null,null,null,null,null,null,null,null,null,null,null,null,null,null,null,null,null,null,null,null,null,null,{"$f":"IF(E2=\"Да\",\"Нет\",\"\")","v":"Нет"},"Нет"]
["Р : Азота оксид (оксид азота (II)) (Р) 2,5 - 100 мг/м3",null,null,null,null,null,null,null,null,null,null,null,null,null,null,null,null,null,null,null,null,null,null,null,null,null,null,null,null,null,null,null,null,null,"ВАРИАНТЫ ВЫПАДАЮЩЕГО СПИСКА ",null,null,null,null,null,null,"СЦЕПКА","ВОЗМОЖНЫЕ ВАР-ТЫ ДИНАМ. СПИСКОВ"]
["Р : Азота оксид (оксид азота (II)) (Р) 2,5 - 100 мг/м4",null,"3 ЗАПОЛНИТЬ↓↓↓"]
["Р : Азота оксид (оксид азота (II)) (Р) 2,5 - 100 мг/м5","Температура эксплуатации газоанализатора","от +5 до +50° С",null,null,null,null,null,null,null,null,null,null,null,null,null,null,null,null,null,null,null,null,null,null,null,null,null,null,null,null,null,null,null,"от +5 до +50° С","от - 50 до + 50 ° С",null,null,null,null,null,{"$f":"_xlfn.CONCAT(C5,\" и \",C6)","v":"от +5 до +50° С и Открытая площадка "},"от - 50 до + 50 ° С и Открытая площадка ","от +5 до +50° С и Открытая площадка ","от - 50 до + 50 ° С и В помещении","от +5 до +50° С и В помещении"]
["Р : Азота оксид (оксид азота (II)) (Р) 2,5 - 100 мг/м6","Место установки оборудования","Открытая площадка ",{"$f":"IF(C7=AJ7,\"УТОЧНИТЬ ПОРОГ (не менее 1 ПДК р.з.)\",\"\")","v":"УТОЧНИТЬ ПОРОГ (не менее 1 ПДК р.з.)"},null,null,null,null,null,null,null,null,null,null,null,null,null,null,null,null,null,null,null,null,null,null,null,null,null,null,null,null,null,null,"Открытая площадка ","В помещении"]
["Р : Азота оксид (оксид азота (II)) (Р) 2,5 - 100 мг/м7","Пороги срабатывания сигн, реле (на блоке питания)","Под заказ (уточнить какие)",null,null,{"$f":"IF(C15=\"ДА\",\"Будет занято СЗО\",\"\")","v":""},null,null,null,null,null,null,null,null,null,null,null,null,null,null,null,null,null,null,null,null,null,null,null,null,null,null,null,null,"1 ПДК р.з. (По умолчанию)","Под заказ (уточнить какие)"]
["Р : Азота оксид (оксид азота (II)) (Р) 2,5 - 100 мг/м9","Питание прибора (на блоке питания)","24В",{"$f":"IF(C9=AJ9,\"Уточнить кабельный ввод\",\"\")","v":"Уточнить кабельный ввод"},null,null,null,null,null,null,null,null,null,null,null,null,null,null,null,null,null,null,null,null,null,null,null,null,null,null,null,null,null,null,"220В (По умолчанию)","24В"]
["Р : Азота оксид (оксид азота (II)) (Р) 2,5 - 100 мг/м8","Подключение","Распределительная коробка с каб.вводами под заказ",null,null,null,null,null,null,null,null,null,null,null,null,null,null,null,null,null,null,null,null,null,null,null,null,null,null,null,null,null,null,null,"Распределительная коробка с каб.вводами M20*1.5 (По умолчанию)","Распределительная коробка с каб.вводами под заказ"]
[null,null,null,{"$f":"IF(C11=AJ11,\"Уточнить кабельный ввод\",\"\")","v":"Уточнить кабельный ввод"}]
{"$rows_left_out":32}
{"sheet":"    ↑↑↑↑  ОЛ ГАНК-ФCEx   ↑↑↑↑  ","index":4,"n_rows":45,"n_cols":47,"rows_kept":45,"cut":false,"hidden":false,"merged":[]}
["1. ВЫБРАТЬ: Наименование вещества↓↓↓","Стандартный порог срабатывания","Типы датчиков (до 1 Х и 3 Д или 4 Д)","Кол-во Химкассет","СР-4","4 КОЛ-ВО ГАНК-4 ЗАПОЛНИТЬ↓↓↓",null,null,null,null,null,null,null,null,null,null,null,null,null,null,null,null,null,null,null,null,null,null,null,null,null,null,null,null,"СР-4",{"$f":"COUNTIF(E2:E5,\"Да\")","v":1},{"$f":"IF(AJ1>0,\"Да\",\"\")","v":"Да"},{"$f":"IF(AJ1>0,\"Нет\",\"\")","v":"Нет"}]
["Р : Азота диоксид (оксид азота (IV)) (Р) 1 - 40 мг/м3",{"$f":"IFERROR(CONCATENATE(VLOOKUP(A2,Данные2!A:AM,26,FALSE),\" мг/м3\"),\" \")","v":"2 мг/м3"},{"$f":"IFERROR(VLOOKUP(A2,Данные2!A:AM,37,FALSE),\" \")","v":"Д"},{"$f":"COUNTIF(C2:C5,\"Х\")","v":1},{"$f":"IFERROR(VLOOKUP(A2,Данные2!A:AN,40,FALSE),\" \")","v":"Нет"}]
["Р : Кислота серная (Р) 0,5 - 20 мг/м3",{"$f":"IFERROR(CONCATENATE(VLOOKUP(A3,Данные2!A:AM,26,FALSE),\" мг/м3\"),\" \")","v":"1 мг/м3"},{"$f":"IFERROR(VLOOKUP(A3,Данные2!A:AM,37,FALSE),\" \")","v":"Х"},"Кол-во датчиков",{"$f":"IFERROR(VLOOKUP(A3,Данные2!A:AN,40,FALSE),\" \")","v":"Да"}]
["Р : Азота оксиды (Р) 2,5 - 100 мг/м3",{"$f":"IFERROR(CONCATENATE(VLOOKUP(A4,Данные2!A:AM,26,FALSE),\" мг/м3\"),\" \")","v":"5 мг/м3"},{"$f":"IFERROR(VLOOKUP(A4,Данные2!A:AM,37,FALSE),\" \")","v":"Д"},{"$f":"COUNTIF(C2:C5,\"Д\")","v":3},{"$f":"IFERROR(VLOOKUP(A4,Данные2!A:AN,40,FALSE),\" \")","v":"Нет"}]
["Р : Амины алифатические (Р) 0,5 - 20 мг/м3",{"$f":"IFERROR(CONCATENATE(VLOOKUP(A5,Данные2!A:AM,26,FALSE),\" мг/м3\"),\" \")","v":"1 мг/м3"},{"$f":"IFERROR(VLOOKUP(A5,Данные2!A:AM,37,FALSE),\" \")","v":"Д"},null,{"$f":"IFERROR(VLOOKUP(A5,Данные2!A:AN,40,FALSE),\" \")","v":"Нет"}]
["Р : Азота оксид (оксид азота (II)) (Р) 2,5 - 100 мг/м3",null,null,null,null,null,null,null,null,null,null,null,null,null,null,null,null,null,null,null,null,null,null,null,null,null,null,null,null,null,null,null,null,null,"ВАРИАНТЫ ВЫПАДАЮЩЕГО СПИСКА ",null,null,null,null,null,null,"СЦЕПКА","ВОЗМОЖНЫЕ ВАР-ТЫ ДИНАМ. СПИСКОВ"]
["Р : Азота оксид (оксид азота (II)) (Р) 2,5 - 100 мг/м4",null,"2 ЗАПОЛНИТЬ↓↓↓"]
["Р : Азота оксид (оксид азота (II)) (Р) 2,5 - 100 мг/м5","Температура эксплуатации газоанализатора","от - 50 до + 50 ° С",null,null,null,null,null,null,null,null,null,null,null,null,null,null,null,null,null,null,null,null,null,null,null,null,null,null,null,null,null,null,null,"от +5 до +50° С","от - 50 до + 50 ° С",null,null,null,null,null,{"$f":"_xlfn.CONCAT(C8,\" и \",C9)","v":"от - 50 до + 50 ° С и Открытая площадка "},"от - 50 до + 50 ° С и Открытая площадка ","от +5 до +50° С и Открытая площадка ","от - 50 до + 50 ° С и В помещении","от +5 до +50° С и В помещении"]
["Р : Азота оксид (оксид азота (II)) (Р) 2,5 - 100 мг/м6","Место установки оборудования","Открытая площадка ",{"$f":"IF(C10=AJ10,\"ПОРОГ 1 не менее 1 ПДК р.з.\",\"\")","v":"ПОРОГ 1 не менее 1 ПДК р.з."},{"$f":"IF(C10=AJ10,\"ПОРОГ 2 не менее 3 ПДК р.з.\",\"\")","v":"ПОРОГ 2 не менее 3 ПДК р.з."},null,null,null,null,null,null,null,null,null,null,null,null,null,null,null,null,null,null,null,null,null,null,null,null,null,null,null,null,null,"Открытая площадка ","В помещении"]
["Р : Азота оксид (оксид азота (II)) (Р) 2,5 - 100 мг/м7","Пороги срабатывания сигн, реле","Под заказ (уточнить какие)",null,null,null,null,null,null,null,null,null,null,null,null,null,null,null,null,null,null,null,null,null,null,null,null,null,null,null,null,null,null,null,"1 ПДК р.з. (По умолчанию)","Под заказ (уточнить какие)"]
{"$rows_left_out":36}
{"sheet":"ИНСТРУКЦИЯ","index":5,"n_rows":23,"n_cols":1,"rows_kept":23,"cut":false,"hidden":false,"merged":[]}
["1. Нажать кнопку \"Разрешить редактирование\""]
[]
["2. Нажать кнопку \"Включить содержимое\""]
[]
["3. Перейти на лист \"Соответствие модификациям\""]
[]
["4. В первой строке выбрать вещество (для удобства можно ввести часть названия)"]
[]
["5. Из выпадающего списка выбрать нужное вещество"]
[]
{"$rows_left_out":14}
{"sheet":"Данные2","index":6,"n_rows":324,"n_cols":40,"rows_kept":324,"cut":false,"hidden":true,"merged":[]}
["Nazvanie pribora","Арт0","Диапазон измерений","А/Р/АР","Х/Д",null,null,"МВИ А","МВИ Р","МВИ АР","Тип номенкл.","А","Р","АР","АEx","РEx","АРEx","РБ","Название вещества","Дож","Пусто2","Пусто3","Пусто4 ","Пусто5","Формула","ПДК","Товар","МВИ ПВ","М/С","СExД/СExХ","Стационарные исполнения","ГАНК-4С","ГАНК-4М","Артикул (С/Мд)","Арт.Мприн","Сex","ТИП Д для Сex","Артикул","Фex","СР-4"]
["Р : Азота диоксид (оксид азота (IV)) (Р) 1 - 40 мг/м3",20012,"1 - 40 мг/м3","Р","Х",null,null,null,null,null,"В-во","Нет","Х","Х","Нет","Х","Х","Д","Азота диоксид (оксид азота (IV)) (Р)",null,null,null,null,null,"NO2",2,null,"Да","М",{"$f":"IF(AC2=\"НЕТ\",\"Нет\",IF(AC2=\"С\",\"Cex (Х)\",IF(AC2=\"М\",\"Cex (Д)\",\" \")))","v":"Cex (Д)"},{"$f":"CONCATENATE(IF(AC2=\"Нет\",\"\",CONCATENATE(AC2,\";\")),IF(AD2=\"Нет\",\"\",AD2))","v":"М;Cex (Д)"},"Нет","ГАНК-4М для определения: Азота диоксид (оксид азота (IV)) (Р)",{"$f":"102000+(B2-2)/10-2000","v":102001},{"$f":"IF(AC2=\"Нет\",\"Нет\",AH2*10+2)","v":1020012},{"$f":"IF(AC2=\"М\",CONCATENATE(\"ГАНК-4СEx (Д) для определения: \",S2),IF(AC2=\"С\",CONCATENATE(\"ГАНК-4СEx (Х) для определения: \",S2),\"Нет\"))","v":"ГАНК-4СEx (Д) для определения: Азота диоксид (оксид азота (IV)) (Р)"},"Д",{"$f":"IF(AC2=\"нет\",\"Нет\",1026000+(B2-2)/10-2000)","v":1026001},{"$f":"IF(AC2=\"М\",CONCATENATE(\"ГАНК-4ФEx (Д) для определения: \",S2),IF(AC2=\"С\",CONCATENATE(\"ГАНК-4ФEx (Х) для определения: \",S2),\"Нет\"))","v":"ГАНК-4ФEx (Д) для определения: Азота диоксид (оксид азота (IV)) (Р)"},"Нет"]
["Р : Азота оксид (оксид азота (II)) (Р) 2,5 - 100 мг/м3",20022,"2,5 - 100 мг/м3","Р","Х",null,null,null,null,null,"В-во","Нет","Х","Х","Нет","Х","Х","Д","Азота оксид (оксид азота (II)) (Р)",null,null,null,null,null,"NO",5,null,"Да","М",{"$f":"IF(AC3=\"НЕТ\",\"Нет\",IF(AC3=\"С\",\"Cex (Х)\",IF(AC3=\"М\",\"Cex (Д)\",\" \")))","v":"Cex (Д)"},{"$f":"CONCATENATE(IF(AC3=\"Нет\",\"\",CONCATENATE(AC3,\";\")),IF(AD3=\"Нет\",\"\",AD3))","v":"М;Cex (Д)"},"Нет","ГАНК-4М для определения: Азота оксид (оксид азота (II)) (Р)",102002,1020022,"ГАНК-4СEx (Д) для определения: Азота оксид (оксид азота (II)) (Р)","Д",1026002,"ГАНК-4ФEx (Д) для определения: Азота оксид (оксид азота (II)) (Р)","Нет"]
["Р : Азота оксиды (Р) 2,5 - 100 мг/м3",20032,"2,5 - 100 мг/м3","Р","Х",null,null,null,null,"АР5","В-во","Нет","Х","Х","Нет","Х","Х","Д","Азота оксиды (Р)",null,null,null,null,null,"NOx",5,null,null,"М","Cex (Д)","М;Cex (Д)","Нет","ГАНК-4М для определения: Азота оксиды (Р)",102003,1020032,"ГАНК-4СEx (Д) для определения: Азота оксиды (Р)","Д",1026003,"ГАНК-4ФEx (Д) для определения: Азота оксиды (Р)","Нет"]
["Р : Кислота азотная (Р) 1 - 40 мг/м3",20042,"1 - 40 мг/м3","Р","Х",null,null,null,"Р03",null,"В-во","Нет","Х","Х","Нет","Х","Х","Нет","Кислота азотная (Р)",null,null,null,null,null,"HNO3",2,null,"Да","С","Cex (Х)","С;Cex (Х)","ГАНК-4С для определения: Кислота азотная (Р)","Нет",102004,1020042,"ГАНК-4СEx (Х) для определения: Кислота азотная (Р)","Х",1026004,"ГАНК-4ФEx (Х) для определения: Кислота азотная (Р)","Да"]
["Р : Амины алифатические (Р) 0,5 - 20 мг/м3",20052,"0,5 - 20 мг/м3","Р","Х",null,null,null,"Р03",null,"В-во","Нет","Х","Х","Нет","Х","Х","Д","Амины алифатические (Р)",null,null,null,null,null,"С15-С20",1,null,null,"М","Cex (Д)","М;Cex (Д)","Нет","ГАНК-4М для определения: Амины алифатические (Р)",102005,1020052,"ГАНК-4СEx (Д) для определения: Амины алифатические (Р)","Д",1026005,"ГАНК-4ФEx (Д) для определения: Амины алифатические (Р)","Нет"]
["Р : Анилин (аминобензол) (Р) 0,05 - 2 мг/м3",20062,"0,05 - 2 мг/м3","Р","Д",null,null,null,"Р04",null,"В-во","Нет","Д","Д","Нет","Д","Д","Д","Анилин (аминобензол) (Р)",null,null,null,null,null,"С6Н5NН2",0.1,null,null,"М","Cex (Д)","М;Cex (Д)","Нет","ГАНК-4М для определения: Анилин (аминобензол) (Р)",102006,1020062,"ГАНК-4СEx (Д) для определения: Анилин (аминобензол) (Р)","Д",1026006,"ГАНК-4ФEx (Д) для определения: Анилин (аминобензол) (Р)","Нет"]
["Р : 2-Аминоэтанол (Моноэтаноламин, 2-аминоэтан-1-ол) (Р) 0,25 - 10 мг/м3",20072,"0,25 - 10 мг/м3","Р","Х",null,null,null,null,null,"В-во","Нет","Х","Х","Нет","Х","Х","Д","2-Аминоэтанол (Моноэтаноламин, 2-аминоэтан-1-ол) (Р)",null,null,null,null,null,"C2H7NO",0.5,null,"ОТ","М","Cex (Д)","М;Cex (Д)","Нет","ГАНК-4М для определения: 2-Аминоэтанол (Моноэтаноламин, 2-аминоэтан-1-ол) (Р)",102007,1020072,"ГАНК-4СEx (Д) для определения: 2-Аминоэтанол (Моноэтаноламин, 2-аминоэтан-1-ол) (Р)","Д",1026007,"ГАНК-4ФEx (Д) для определения: 2-Аминоэтанол (Моноэтаноламин, 2-аминоэтан-1-ол) (Р)","Нет"]
["Р : Аммиак (Р) 10 - 400 мг/м3",20082,"10 - 400 мг/м3","Р","Х",null,null,null,null,null,"В-во","Нет","Х","Х","Нет","Х","Х","Д","Аммиак (Р)",null,null,null,null,null,"NH3",20,null,"Да","М","Cex (Д)","М;Cex (Д)","Нет","ГАНК-4М для определения: Аммиак (Р)",102008,1020082,"ГАНК-4СEx (Д) для определения: Аммиак (Р)","Д",1026008,"ГАНК-4ФEx (Д) для определения: Аммиак (Р)","Нет"]
["Р : Ацетальдегид (этаналь, уксусный альдегид) (Р) 2,5 - 100 мг/м3",20092,"2,5 - 100 мг/м3","Р","Д",null,null,null,null,null,"В-во","Нет","Д","Д","Нет","Д","Д","Д","Ацетальдегид (этаналь, уксусный альдегид) (Р)",null,null,null,null,null,"C2H3OH",5,null,"Да","М","Cex (Д)","М;Cex (Д)","Нет","ГАНК-4М для определения: Ацетальдегид (этаналь, уксусный альдегид) (Р)",102009,1020092,"ГАНК-4СEx (Д) для определения: Ацетальдегид (этаналь, уксусный альдегид) (Р)","Д",1026009,"ГАНК-4ФEx (Д) для определения: Ацетальдегид (этаналь, уксусный альдегид) (Р)","Нет"]
{"$rows_left_out":314}